{"text_format":"1","workbook":"xlsx","n_sheets":6,"sheets":["CATALOGUE","APR","APRRetail","APRBulk","NonZero","Instructions"],"not_rendered":{"charts":0,"images":48,"macros":1,"external_links":0,"defined_names":6,"comments":0,"pivot_tables":0},"unopened":[],"bounds":{"document_bytes":16777216,"sheet_cells":100000,"rows_first":2000,"rows_last":500,"rows_between":2000,"halvings":0,"cell_chars":16384,"cell_head_chars":4096},"cells_cut":0,"cells_raw":0,"read":"whole","date_system":"1900"}

{"sheet":"CATALOGUE","index":0,"n_rows":186,"n_cols":10,"rows_kept":186,"cut":false,"hidden":false,"merged":[[0,0,0,7],[2,6,2,7],[2,3,2,4],[2,2,3,2],[2,1,3,1],[2,0,3,0]]}
["CATALOGUE"]
[null,null,"SEARCH ITEM:"]
["SELECT\n\nALL","ITEM CODE","ITEM DESCRIPTION/SPECIFICATIONS","RETAIL",null,null,"BIG BOX"]
[null,null,null,"UNIT","UNIT PRICE\n(as of 12/01/2016)",null,"UNIT","UNIT PRICE\n(as of 12/01/2016)",null,182]
[1,"13111203-AC-F01","ACETATE","roll",624,2,"roll",624,2]
[2,"47131812-AF-A01","AIR FRESHENER, aerosol, 280ml/150g min            ","can",83.2,12,"box",998.4,12]
[3,"12191601-AL-E01","ALCOHOL, ethyl, 68%-70%, scented, 500ml (-5ml)    ","bottle",47.82,36,"box",1721.52,36]
[4,"39111801-BA-F02","BALLAST, 36 WATTS","piece",74.78,26,"box",1944.28,26]
[5,"26111702-BT-A02","BATTERY, dry cell, AA, 2 pieces per blister pack","pack",19.5,10,"box",195,50]
[6,"26111702-BT-A01","BATTERY, dry cell, AAA, 2 pieces per blister pack","pack",18.46,10,"box",184.6,50]
[7,"26111702-BT-A03","BATTERY, dry cell, D, 2 pieces per blister pack","pack",88.4,10,"box",884,60]
[8,"44101602-PB-M01","BINDING AND PUNCHING MACHINE","unit",10400,3,"unit",10400,3]
[9,"47131604-BR-S01","BROOM, SOFT (TAMBO), weight: 200g min tiger grass ","piece",88.4,25,"bundle",2210,25]
[10,"47131604-BR-T01","BROOM, STICK (TINGTING)","piece",23.92,25,"bundle",598,25]
[11,"44101807-CA-C01","CALCULATOR, COMPACT, electronic, 12 digits cap, 1 unit\nin individual box","unit",135.19999999999999,40,"carton",5408,40]
[12,"44101810-CA-D01","CALCULATOR, MINI-PRINTING, 1 unit per box","unit",930.8,20,"pack",18616,20]
[13,"44101810-CA-D02","CALCULATOR, PRINTING, DESKTOP, 1 unit per box","unit",1965.6,6,"pack",11793.6,12]
[14,"44101807-CA-S01","CALCULATOR, SCIENTIFIC, 1 unit in indiviual box","unit",258.83999999999997,40,"carton",10353.6,40]
[15,"13111201-CF-P01","CARBON FILM, A4 SIZE, 100 sheets per box","box",197.58,50,"carton",9879,50]
[16,"13111201-CF-P02","CARBON FILM, PE, black, size 216mm x 330mm, 100 sheets per box     ","box",202.8,50,"carton",10140,50]
[17,"14111525-CA-A01","CARTOLINA, ASSORTED COLORS, 20 pieces per pack","pack",64.48,5,"bundle",322.39999999999998,10]
[18,"14111525-CA-W01","CARTOLINA, WHITE, 20 pieces per pack","pack",52,5,"bundle",260,10]
[19,"56101504-CM-B01","CHAIR, MONOBLOC, BEIGE, with backrest, w/o armrest","piece",254.68,25,"stack",6367,2]
[20,"56101504-CM-W01","CHAIR, MONOBLOC, WHITE, with backrest, w/o armrest","piece",254.8,25,"stack",6370,2]
[21,"44121710-CH-W01","CHALK, WHITE ENAMEL, 100 pieces per box","box",25.86,30,"carton",775.8,2]
[22,"47131829-TB-C01","CLEANER, TOILET BOWL AND URINAL, , 900ml-1,000ml cap","bottle",41.6,12,"box",499.2,25]
[23,"47131805-CL-P01","CLEANSER, SCOURING POWDER, 350g min./can","can",21.27,48,"box",1020.96,25]
[24,"60121413-CB-P01","CLEARBOOK, A4 SIZE","piece",39.520000000000003,12,"box",474.24,30]
[25,"60121413-CB-P02","CLEARBOOK, LEGAL","piece",43.68,12,"box",524.16,12]
[26,"44122105-BF-C01","CLIP, BACKFOLD, 19MM, 12 pieces per box","box",7.28,50,"carton",364,48]
{"$rows_left_out":157}
{"sheet":"APR","index":1,"n_rows":216,"n_cols":16,"rows_kept":216,"cut":false,"hidden":false,"merged":[[3,11,3,12],[212,1,212,13],[4,0,4,8],[18,2,19,2],[18,1,19,1],[18,0,19,0],[17,0,17,13],[206,0,206,13],[205,0,205,13],[202,0,202,7],[13,1,13,9],[15,1,15,11],[16,1,16,11],[215,1,215,10],[1,0,1,1],[2,0,2,1],[3,0,3,1],[204,0,204,13],[18,3,18,4],[18,6,18,9],[18,10,18,13],[1,11,1,12],[2,11,2,12],[4,10,4,12],[1,2,1,8],[2,2,2,8],[3,2,3,8],[1,9,1,10],[2,9,2,10],[214,1,214,8],[207,1,207,13],[211,1,211,13],[203,12,203,13],[10,1,10,8],[12,1,12,9]]}
["APR FORM revised May 2015 ",null,null,null,null,null,null,null,null,null,null,null,null,null,11]
["AGENCY NAME *",null,null,null,null,null,null,null,null,"AGENCY ACCOUNT CODE *"]
["ADDRESS *",null,null,null,null,null,null,null,null,"AGENCY CONTROL No."]
["TEL. NOS. *",null,null,null,null,null,null,null,null,"DATE PREPARED:"]
["AGENCY PROCUREMENT REQUEST",null,null,null,null,null,null,null,null,"PS APR No."]
[]
["To:","PROCUREMENT SERVICE"]
[null,"DBM Compound, RR Road"]
[null,"Cristobal St., Paco, Manila"]
[]
[null,"PLEASE INDICATE (X) APPROPRIATE BOX ON ACTION REQUESTED ON THE ITEMS LISTED BELOW"]
[]
[null,"[  ]  Please issue common-use supplies/materials as indicated below"]
[null,"Mode of delivery: [  ] Pick-up (Fast Lane)           [  ] Pick-up (Schedule)           [  ] Scheduled Delivery on ________________________"]
[]
[null,"In case fund is not sufficient: [  ] Reduce Quantity           [  ] Charge to Unutilized Deposit, APR No.: ___________ Date: ____________"]
[null,"( * Please verify with PS-Accounting prior to your transaction date)"]
[]
[null,"ITEM CODE","ITEM DESCRIPTION/\nSPECIFICATIONS","REQUESTED",null,null,"RETAIL",null,null,null,"BIG BOX"]
[null,null,null,"QTY","UNIT","RETAIL/ BULK","QTY","UNIT",{"$f":"CATALOGUE!E4","v":"UNIT PRICE\n(as of 12/01/2016)"}," AMOUNT","QTY","UNIT",{"$f":"CATALOGUE!H4","v":"UNIT PRICE\n(as of 12/01/2016)"},"AMOUNT",null,"Select \"Remove\" to Delete Item/s"]
[{"$f":"SUBTOTAL(103,C$21:C21)","v":0},"13111203-AC-F01","ACETATE",0,"roll",2,{"$f":"IF(D21>F21,0,D21)","v":0},"roll",624,{"$f":"G21*I21","v":0},{"$f":"IF(D21>F21,D21,0)","v":0},"roll",624,{"$f":"K21*M21","v":0},{"$f":"COUNTIF(G21:G202,\">0\")","v":0},"-"]
[{"$f":"SUBTOTAL(103,C$21:C22)","v":0},"47131812-AF-A01","AIR FRESHENER, aerosol, 280ml/150g min            ",0,"can",12,{"$f":"MOD(D22,F22)","v":0},"can",83.2,0,{"$f":"QUOTIENT(D22,F22)","v":0},"box",998.4,0,{"$f":"COUNTIF(K21:K202,\">0\")","v":0},"-"]
[{"$f":"SUBTOTAL(103,C$21:C23)","v":0},"12191601-AL-E01","ALCOHOL, ethyl, 68%-70%, scented, 500ml (-5ml)    ",0,"bottle",36,{"$f":"MOD(D23,F23)","v":0},"bottle",47.82,0,{"$f":"QUOTIENT(D23,F23)","v":0},"box",1721.52,0,{"$f":"SUMPRODUCT(SUBTOTAL(103,OFFSET(D21,ROW(D21:D202)-ROW(D21),0)),(D21:D202=0)+0)","v":0},"-"]
[{"$f":"SUBTOTAL(103,C$21:C24)","v":0},"39111801-BA-F02","BALLAST, 36 WATTS",0,"piece",26,{"$f":"MOD(D24,F24)","v":0},"piece",74.78,0,{"$f":"QUOTIENT(D24,F24)","v":0},"box",1944.28,0,{"$f":"COUNTIF(D21:D202,\"\")","v":0},"-"]
[{"$f":"SUBTOTAL(103,C$21:C25)","v":0},"26111702-BT-A02","BATTERY, dry cell, AA, 2 pieces per blister pack",0,"pack",10,{"$f":"IF(D25>49,(MOD(D25,F25)),D25)","v":0},"pack",19.5,0,{"$f":"IF(D25>49,(QUOTIENT(D25,F25)),0)","v":0},"box",195,0,null,"-"]
[{"$f":"SUBTOTAL(103,C$21:C26)","v":0},"26111702-BT-A01","BATTERY, dry cell, AAA, 2 pieces per blister pack",0,"pack",10,{"$f":"IF(D26>49,(MOD(D26,F26)),D26)","v":0},"pack",18.46,0,{"$f":"IF(D26>49,(QUOTIENT(D26,F26)),0)","v":0},"box",184.6,0,null,"-"]
[{"$f":"SUBTOTAL(103,C$21:C27)","v":0},"26111702-BT-A03","BATTERY, dry cell, D, 2 pieces per blister pack",0,"pack",10,{"$f":"IF(D27>49,(MOD(D27,F27)),D27)","v":0},"pack",88.4,0,{"$f":"IF(D27>49,(QUOTIENT(D27,F27)),0)","v":0},"box",884,0,null,"-"]
[{"$f":"SUBTOTAL(103,C$21:C28)","v":0},"44101602-PB-M01","BINDING AND PUNCHING MACHINE",0,"unit",3,{"$f":"IF(D28>F28,0,D28)","v":0},"unit",10400,0,{"$f":"IF(D28>F28,D28,0)","v":0},"unit",10400,0,null,"-"]
[{"$f":"SUBTOTAL(103,C$21:C29)","v":0},"47131604-BR-S01","BROOM, SOFT (TAMBO), weight: 200g min tiger grass ",0,"piece",25,{"$f":"MOD(D29,F29)","v":0},"piece",88.4,0,{"$f":"QUOTIENT(D29,F29)","v":0},"bundle",2210,0,null,"-"]
[{"$f":"SUBTOTAL(103,C$21:C30)","v":0},"47131604-BR-T01","BROOM, STICK (TINGTING)",0,"piece",25,0,"piece",23.92,0,0,"bundle",598,0,null,"-"]
{"$rows_left_out":187}
{"sheet":"APRRetail","index":2,"n_rows":761,"n_cols":8,"rows_kept":761,"cut":false,"hidden":false,"merged":[[760,0,760,6],[680,0,680,6],[684,0,684,6],[685,0,685,6],[687,0,687,6],[688,0,688,6],[749,0,749,6],[750,0,750,6],[752,0,752,6],[756,0,756,6],[757,0,757,6],[759,0,759,6],[751,0,751,6],[678,0,678,6],[510,0,510,6],[512,0,512,6],[513,0,513,6],[605,0,605,6],[606,0,606,6],[608,0,608,6],[612,0,612,6],[613,0,613,6],[615,0,615,6],[616,0,616,6],[677,0,677,6],[607,0,607,6],[679,0,679,6],[12,1,12,4],[14,1,14,4],[17,0,17,6],[18,0,19,0],[18,1,19,1],[18,2,19,2],[18,3,18,6],[13,1,13,5],[15,1,15,6],[16,1,16,6],[203,0,203,6],[204,0,204,6],[206,0,206,6],[210,0,210,6],[211,0,211,6],[4,0,4,3],[4,5,4,6],[1,0,1,1],[1,4,1,5],[2,0,2,1],[2,4,2,5],[3,0,3,1],[1,2,1,3],[2,2,2,3],[3,2,3,3],[205,0,205,6],[509,0,509,6],[214,0,214,6],[368,0,368,6],[369,0,369,6],[213,0,213,6],[371,0,371,6],[375,0,375,6],[376,0,376,6],[378,0,378,6],[379,0,379,6],[502,0,502,6],[503,0,503,6],[505,0,505,6],[370,0,370,6],[504,0,504,6]]}
["APR FORM revised May 2015 ",null,null,null,null,null,"FORM NO. 001-R",29]
["AGENCY NAME",null,"A",null,"AGENCY ACCOUNT CODE",null,"A"]
["ADDRESS",null,"A",null,"AGENCY CONTROL No.",null,{"$f":"IF(APR!L3<>\"\",APR!L3,\"\")","v":""}]
["TEL. NOS.",null,"A",null,"DATE PREPARED",null,{"$f":"IF(APR!L4<>\"\",APR!L4,\"\")","v":""}]
["AGENCY PROCUREMENT REQUEST",null,null,null,"PS APR No."]
[]
["To:","PROCUREMENT SERVICE"]
[null,"DBM Compound, RR Road"]
[null,"Cristobal St., Paco, Manila"]
[]
[null,"PLEASE INDICATE (X) APPROPRIATE BOX ON ACTION REQUESTED ON THE ITEMS LISTED BELOW"]
[]
[null,"[  ]  Please issue common-use supplies/materials as indicated below"]
[null,"Mode of delivery: [  ] Pick-up (Fast Lane)   [  ] Pick-up (Schedule)   [  ] Scheduled Delivery on ________________________"]
[]
[null,"In case fund is not sufficient: [  ] Reduce Quantity           [  ] Charge to Unutilized Deposit, APR No.: ___________ Date: ____________"]
[null,"( * Please verify with PS-Accounting prior to your transaction date)"]
[]
[null,"ITEM CODE","ITEM DESCRIPTION/SPECIFICATIONS","RETAIL"]
[null,null,null,"QTY","UNIT",{"$f":"CATALOGUE!E4","v":"UNIT PRICE\n(as of 12/01/2016)"}," AMOUNT"]
[{"$f":"SUBTOTAL(103,C$21:C21)","v":0},"13111203-AC-F01","ACETATE",{"$f":"APR!G21","v":0},{"$f":"APR!H21","v":"roll"},{"$f":"APR!I21","v":624},{"$f":"D21*F21","v":0}]
[{"$f":"SUBTOTAL(103,C$21:C22)","v":1},"47131812-AF-A01","AIR FRESHENER, aerosol, 280ml/150g min            ",{"$f":"APR!G22","v":0},{"$f":"APR!H22","v":"can"},{"$f":"APR!I22","v":83.2},0]
[{"$f":"SUBTOTAL(103,C$21:C23)","v":2},"12191601-AL-E01","ALCOHOL, ethyl, 68%-70%, scented, 500ml (-5ml)    ",{"$f":"APR!G23","v":0},{"$f":"APR!H23","v":"bottle"},{"$f":"APR!I23","v":47.82},0]
[{"$f":"SUBTOTAL(103,C$21:C24)","v":3},"39111801-BA-F02","BALLAST, 36 WATTS",{"$f":"APR!G24","v":0},{"$f":"APR!H24","v":"piece"},{"$f":"APR!I24","v":74.78},0]
[{"$f":"SUBTOTAL(103,C$21:C25)","v":3},"26111702-BT-A02","BATTERY, dry cell, AA, 2 pieces per blister pack",{"$f":"APR!G25","v":0},{"$f":"APR!H25","v":"pack"},{"$f":"APR!I25","v":19.5},0]
[{"$f":"SUBTOTAL(103,C$21:C26)","v":3},"26111702-BT-A01","BATTERY, dry cell, AAA, 2 pieces per blister pack",{"$f":"APR!G26","v":0},{"$f":"APR!H26","v":"pack"},{"$f":"APR!I26","v":18.46},0]
[{"$f":"SUBTOTAL(103,C$21:C27)","v":3},"26111702-BT-A03","BATTERY, dry cell, D, 2 pieces per blister pack",{"$f":"APR!G27","v":0},{"$f":"APR!H27","v":"pack"},{"$f":"APR!I27","v":88.4},0]
[{"$f":"SUBTOTAL(103,C$21:C28)","v":3},"44101602-PB-M01","BINDING AND PUNCHING MACHINE",{"$f":"APR!G28","v":0},{"$f":"APR!H28","v":"unit"},{"$f":"APR!I28","v":10400},0]
[{"$f":"SUBTOTAL(103,C$21:C29)","v":3},"47131604-BR-S01","BROOM, SOFT (TAMBO), weight: 200g min tiger grass ",{"$f":"APR!G29","v":0},{"$f":"APR!H29","v":"piece"},{"$f":"APR!I29","v":88.4},0]
[{"$f":"SUBTOTAL(103,C$21:C30)","v":3},"47131604-BR-T01","BROOM, STICK (TINGTING)",{"$f":"APR!G30","v":0},{"$f":"APR!H30","v":"piece"},{"$f":"APR!I30","v":23.92},0]
{"$rows_left_out":732}
{"sheet":"APRBulk","index":3,"n_rows":761,"n_cols":7,"rows_kept":761,"cut":false,"hidden":false,"merged":[[607,0,607,6],[679,0,679,6],[751,0,751,6],[678,0,678,6],[510,0,510,6],[512,0,512,6],[513,0,513,6],[605,0,605,6],[606,0,606,6],[608,0,608,6],[612,0,612,6],[613,0,613,6],[615,0,615,6],[616,0,616,6],[677,0,677,6],[760,0,760,6],[680,0,680,6],[684,0,684,6],[685,0,685,6],[687,0,687,6],[688,0,688,6],[749,0,749,6],[750,0,750,6],[752,0,752,6],[756,0,756,6],[757,0,757,6],[759,0,759,6],[12,1,12,4],[14,1,14,4],[17,0,17,6],[18,0,19,0],[18,1,19,1],[18,2,19,2],[18,3,18,6],[13,1,13,5],[15,1,15,6],[16,1,16,6],[203,0,203,6],[204,0,204,6],[206,0,206,6],[210,0,210,6],[211,0,211,6],[205,0,205,6],[4,0,4,3],[4,5,4,6],[1,0,1,1],[1,4,1,5],[2,0,2,1],[2,4,2,5],[3,0,3,1],[1,2,1,3],[2,2,2,3],[3,2,3,3],[509,0,509,6],[214,0,214,6],[368,0,368,6],[213,0,213,6],[369,0,369,6],[371,0,371,6],[375,0,375,6],[376,0,376,6],[378,0,378,6],[379,0,379,6],[502,0,502,6],[503,0,503,6],[505,0,505,6],[370,0,370,6],[504,0,504,6]]}
["APR FORM revised May 2015 ",null,null,null,null,null,"FORM NO. 001-B"]
["AGENCY NAME",null,"A",null,"AGENCY ACCOUNT CODE",null,"A"]
["ADDRESS",null,"A",null,"AGENCY CONTROL No.",null,{"$f":"IF(APR!L3<>\"\",APR!L3,\"\")","v":""}]
["TEL. NOS.",null,"A",null,"DATE PREPARED",null,{"$f":"IF(APR!L4<>\"\",APR!L4,\"\")","v":""}]
["AGENCY PROCUREMENT REQUEST",null,null,null,"PS APR No."]
[]
["To:","PROCUREMENT SERVICE"]
[null,"DBM Compound, RR Road"]
[null,"Cristobal St., Paco, Manila"]
[]
[null,"PLEASE INDICATE (X) APPROPRIATE BOX ON ACTION REQUESTED ON THE ITEMS LISTED BELOW"]
[]
[null,"[  ]  Please issue common-use supplies/materials as indicated below"]
[null,"Mode of delivery: [  ] Pick-up (Fast Lane)   [  ] Pick-up (Schedule)   [  ] Scheduled Delivery on ________________________"]
[]
[null,"In case fund is not sufficient: [  ] Reduce Quantity           [  ] Charge to Unutilized Deposit, APR No.: ___________ Date: ____________"]
[null,"( * Please verify with PS-Accounting prior to your transaction date)"]
[]
[null,"ITEM CODE","ITEM DESCRIPTION/SPECIFICATIONS","BIG BOX"]
[null,null,null,"QTY","UNIT",{"$f":"CATALOGUE!H4","v":"UNIT PRICE\n(as of 12/01/2016)"}," AMOUNT"]
[{"$f":"SUBTOTAL(103,C$21:C21)","v":1},"13111203-AC-F01","ACETATE",{"$f":"APR!K21","v":0},{"$f":"APR!L21","v":"roll"},{"$f":"APR!M21","v":624},{"$f":"D21*F21","v":0}]
[{"$f":"SUBTOTAL(103,C$21:C22)","v":2},"47131812-AF-A01","AIR FRESHENER, aerosol, 280ml/150g min            ",{"$f":"APR!K22","v":0},{"$f":"APR!L22","v":"box"},{"$f":"APR!M22","v":998.4},0]
[{"$f":"SUBTOTAL(103,C$21:C23)","v":3},"12191601-AL-E01","ALCOHOL, ethyl, 68%-70%, scented, 500ml (-5ml)",{"$f":"APR!K23","v":0},{"$f":"APR!L23","v":"box"},{"$f":"APR!M23","v":1721.52},0]
[{"$f":"SUBTOTAL(103,C$21:C24)","v":4},"39111801-BA-F02","BALLAST, 36 WATTS",{"$f":"APR!K24","v":0},{"$f":"APR!L24","v":"box"},{"$f":"APR!M24","v":1944.28},0]
[{"$f":"SUBTOTAL(103,C$21:C25)","v":5},"26111702-BT-A02","BATTERY, dry cell, AA",{"$f":"APR!K25","v":0},{"$f":"APR!L25","v":"box"},{"$f":"APR!M25","v":195},0]
[{"$f":"SUBTOTAL(103,C$21:C26)","v":6},"26111702-BT-A01","BATTERY, dry cell, AAA",{"$f":"APR!K26","v":0},{"$f":"APR!L26","v":"box"},{"$f":"APR!M26","v":184.6},0]
[{"$f":"SUBTOTAL(103,C$21:C27)","v":7},"26111702-BT-A03","BATTERY, dry cell, D",{"$f":"APR!K27","v":0},{"$f":"APR!L27","v":"box"},{"$f":"APR!M27","v":884},0]
[{"$f":"SUBTOTAL(103,C$21:C28)","v":8},"44101602-PB-M01","BINDING AND PUNCHING MACHINE",{"$f":"APR!K28","v":0},{"$f":"APR!L28","v":"unit"},{"$f":"APR!M28","v":10400},0]
[{"$f":"SUBTOTAL(103,C$21:C29)","v":9},"47131604-BR-S01","BROOM, SOFT (TAMBO), weight: 200g min tiger grass ",{"$f":"APR!K29","v":0},{"$f":"APR!L29","v":"bundle"},{"$f":"APR!M29","v":2210},0]
[{"$f":"SUBTOTAL(103,C$21:C30)","v":10},"47131604-BR-T01","BROOM, STICK (TINGTING)",{"$f":"APR!K30","v":0},{"$f":"APR!L30","v":"bundle"},{"$f":"APR!M30","v":598},0]
{"$rows_left_out":732}
{"sheet":"NonZero","index":4,"n_rows":367,"n_cols":7,"rows_kept":367,"cut":false,"hidden":false,"merged":[]}
[null,"ITEM CODE","ITEM DESCRIPTION/SPECIFICATIONS","QTY","UNIT","UNIT PRICE"," AMOUNT"]
[{"$f":"SUBTOTAL(103,C$2:C2)","v":0},"13111203-AC-F01","ACETATE",{"$f":"APR!G21","v":0},{"$f":"APR!H21","v":"roll"},{"$f":"APR!I21","v":624},{"$f":"D2*F2","v":0}]
[{"$f":"SUBTOTAL(103,C$2:C3)","v":1},"47131812-AF-A01","AIR FRESHENER, aerosol, 280ml/150g min            ",{"$f":"APR!G22","v":0},{"$f":"APR!H22","v":"can"},{"$f":"APR!I22","v":83.2},0]
[{"$f":"SUBTOTAL(103,C$2:C4)","v":2},"12191601-AL-E01","ALCOHOL, ethyl, 68%-70%, scented, 500ml (-5ml)    ",{"$f":"APR!G23","v":0},{"$f":"APR!H23","v":"bottle"},{"$f":"APR!I23","v":47.82},0]
[{"$f":"SUBTOTAL(103,C$2:C5)","v":3},"39111801-BA-F02","BALLAST, 36 WATTS",{"$f":"APR!G24","v":0},{"$f":"APR!H24","v":"piece"},{"$f":"APR!I24","v":74.78},0]
[{"$f":"SUBTOTAL(103,C$2:C6)","v":3},"26111702-BT-A02","BATTERY, dry cell, AA, 2 pieces per blister pack",{"$f":"APR!G25","v":0},{"$f":"APR!H25","v":"pack"},{"$f":"APR!I25","v":19.5},0]
[{"$f":"SUBTOTAL(103,C$2:C7)","v":3},"26111702-BT-A01","BATTERY, dry cell, AAA, 2 pieces per blister pack",{"$f":"APR!G26","v":0},{"$f":"APR!H26","v":"pack"},{"$f":"APR!I26","v":18.46},0]
[{"$f":"SUBTOTAL(103,C$2:C8)","v":3},"26111702-BT-A03","BATTERY, dry cell, D, 2 pieces per blister pack",{"$f":"APR!G27","v":0},{"$f":"APR!H27","v":"pack"},{"$f":"APR!I27","v":88.4},0]
[{"$f":"SUBTOTAL(103,C$2:C9)","v":3},"44101602-PB-M01","BINDING AND PUNCHING MACHINE",{"$f":"APR!G28","v":0},{"$f":"APR!H28","v":"unit"},{"$f":"APR!I28","v":10400},0]
[{"$f":"SUBTOTAL(103,C$2:C10)","v":3},"47131604-BR-S01","BROOM, SOFT (TAMBO), weight: 200g min tiger grass ",{"$f":"APR!G29","v":0},{"$f":"APR!H29","v":"piece"},{"$f":"APR!I29","v":88.4},0]
[{"$f":"SUBTOTAL(103,C$2:C11)","v":3},"47131604-BR-T01","BROOM, STICK (TINGTING)",{"$f":"APR!G30","v":0},{"$f":"APR!H30","v":"piece"},{"$f":"APR!I30","v":23.92},0]
[{"$f":"SUBTOTAL(103,C$2:C12)","v":4},"44101807-CA-C01","CALCULATOR, COMPACT, electronic, 12 digits cap, 1 unit\nin individual box",{"$f":"APR!G31","v":0},{"$f":"APR!H31","v":"unit"},{"$f":"APR!I31","v":135.19999999999999},0]
[{"$f":"SUBTOTAL(103,C$2:C13)","v":4},"44101810-CA-D01","CALCULATOR, MINI-PRINTING, 1 unit per box",{"$f":"APR!G32","v":0},{"$f":"APR!H32","v":"unit"},{"$f":"APR!I32","v":930.8},0]
[{"$f":"SUBTOTAL(103,C$2:C14)","v":5},"44101810-CA-D02","CALCULATOR, PRINTING, DESKTOP, 1 unit per box",{"$f":"APR!G33","v":0},{"$f":"APR!H33","v":"unit"},{"$f":"APR!I33","v":1965.6},0]
[{"$f":"SUBTOTAL(103,C$2:C15)","v":6},"44101808-CA-S01","CALCULATOR, SCIENTIFIC, 1 unit in indiviual box",{"$f":"APR!G34","v":0},{"$f":"APR!H34","v":"unit"},{"$f":"APR!I34","v":258.83999999999997},0]
[{"$f":"SUBTOTAL(103,C$2:C16)","v":6},"13111201-CF-P01","CARBON FILM, A4 SIZE, 100 sheets per box",{"$f":"APR!G35","v":0},{"$f":"APR!H35","v":"box"},{"$f":"APR!I35","v":197.58},0]
[{"$f":"SUBTOTAL(103,C$2:C17)","v":6},"13111201-CF-P02","CARBON FILM, PE, black, size 216mm x 330mm, 100 sheets per box     ",{"$f":"APR!G36","v":0},{"$f":"APR!H36","v":"box"},{"$f":"APR!I36","v":202.8},0]
[{"$f":"SUBTOTAL(103,C$2:C18)","v":6},"14111525-CA-A01","CARTOLINA, ASSORTED COLORS, 20 pieces per pack",{"$f":"APR!G37","v":0},{"$f":"APR!H37","v":"pack"},{"$f":"APR!I37","v":64.48},0]
[{"$f":"SUBTOTAL(103,C$2:C19)","v":6},"14111525-CA-W01","CARTOLINA, WHITE, 20 pieces per pack",{"$f":"APR!G38","v":0},{"$f":"APR!H38","v":"pack"},{"$f":"APR!I38","v":52},0]
[{"$f":"SUBTOTAL(103,C$2:C20)","v":6},"56101504-CM-B01","CHAIR, MONOBLOC, BEIGE, with backrest, w/o armrest",{"$f":"APR!G39","v":0},{"$f":"APR!H39","v":"piece"},{"$f":"APR!I39","v":254.68},0]
[{"$f":"SUBTOTAL(103,C$2:C21)","v":6},"56101504-CM-W01","CHAIR, MONOBLOC, WHITE, with backrest, w/o armrest",{"$f":"APR!G40","v":0},{"$f":"APR!H40","v":"piece"},{"$f":"APR!I40","v":254.8},0]
[{"$f":"SUBTOTAL(103,C$2:C22)","v":7},"44121710-CH-W01","CHALK, WHITE ENAMEL, 100 pieces per box",{"$f":"APR!G41","v":0},{"$f":"APR!H41","v":"box"},{"$f":"APR!I41","v":25.86},0]
[{"$f":"SUBTOTAL(103,C$2:C23)","v":8},"47131829-TB-C01","CLEANER, TOILET BOWL AND URINAL, , 900ml-1,000ml cap",{"$f":"APR!G42","v":0},{"$f":"APR!H42","v":"bottle"},{"$f":"APR!I42","v":41.6},0]
[{"$f":"SUBTOTAL(103,C$2:C24)","v":9},"47131805-CL-P01","CLEANSER, SCOURING POWDER, 350g min./can",{"$f":"APR!G43","v":0},{"$f":"APR!H43","v":"can"},{"$f":"APR!I43","v":21.27},0]
[{"$f":"SUBTOTAL(103,C$2:C25)","v":10},"60121413-CB-P01","CLEARBOOK, A4 SIZE",{"$f":"APR!G44","v":0},{"$f":"APR!H44","v":"piece"},{"$f":"APR!I44","v":39.520000000000003},0]
[{"$f":"SUBTOTAL(103,C$2:C26)","v":11},"60121413-CB-P02","CLEARBOOK, LEGAL",{"$f":"APR!G45","v":0},{"$f":"APR!H45","v":"piece"},{"$f":"APR!I45","v":43.68},0]
[{"$f":"SUBTOTAL(103,C$2:C27)","v":11},"44122105-BF-C01","CLIP, BACKFOLD, 19MM, 12 pieces per box",{"$f":"APR!G46","v":0},{"$f":"APR!H46","v":"box"},{"$f":"APR!I46","v":7.28},0]
[{"$f":"SUBTOTAL(103,C$2:C28)","v":11},"44122105-BF-C02","CLIP, BACKFOLD, 25MM, 12 pieces per box",{"$f":"APR!G47","v":0},{"$f":"APR!H47","v":"box"},{"$f":"APR!I47","v":10.4},0]
[{"$f":"SUBTOTAL(103,C$2:C29)","v":11},"44122105-BF-C03","CLIP, BACKFOLD, 32MM, 12 pieces per box",{"$f":"APR!G48","v":0},{"$f":"APR!H48","v":"box"},{"$f":"APR!I48","v":19.12},0]
[{"$f":"SUBTOTAL(103,C$2:C30)","v":11},"44122105-BF-C04","CLIP, BACKFOLD, 50MM, 12 pieces per box",{"$f":"APR!G49","v":0},{"$f":"APR!H49","v":"box"},{"$f":"APR!I49","v":36.380000000000003},0]
{"$rows_left_out":338}
{"sheet":"Instructions","index":5,"n_rows":30,"n_cols":3,"rows_kept":30,"cut":false,"hidden":false,"merged":[[0,0,0,2],[2,0,2,2],[3,0,3,2]]}
["INSTRUCTIONS/CONDITIONS"]
[]
["AGENCY PROCUREMENT REQUEST (APR)"]
["PS Form No. 001"]
[]
["1.0","ACCOMPLISHMENT"]
[]
[null,"1.1","This request form shall be prepared for orders or requisitions of COMMON-USE SUPPLIES, MATERIALS AND EQUIPMENT from the PS Warehouses.  For a complete listing of these items, please refer to the Electronic Catalogue @ www.philgeps.gov.ph.  It shall be prepared in five (5) copies by requisitioning agencies and submitted to the Agency Servicing Division (ASD).  Appropriate box should be properly marked for the desired transaction and the Agency Control Number (ACN) clearly indicated in the space provided."]
[]
[null,"1.2","FUNDING: Pursuant to Section 445.b, paragraph 2 of the Government Auditing and Accounting Manual (GAAM) and Section 4b paragraph 2 of the Executive Order 359; agencies shall remit in advance to the Procurement Service the funds needed to service their requirements for the supplies, materials and equipment as reflected in the said Work and Financial Plan/Annual Procurement Program (APP)."]
[]
["2.0","DELIVERY SCHEME"]
[]
[null,"2.1","For items intended for pick-up, servicing of this transaction shall be through a Fast Lane for which the processing time should take an hour or less, dependent however on the items being ordered or the volume of transactions for the day."]
[]
[null,"2.2","If the agency desires to pick-up the goods at a later/preferred date, this information shall be indicated/stamped in the APR: “For Pick-up on __________”.  The agency shall then come back for the goods on the date as committed otherwise, PS shall deliver the items within three (3) days with reasonable charge for freight or delivery, or cancel the Delivery Receipt (DR)."]
[]
[null,"2.3","Delivery within Metro Manila is free-of-charge depending on the volume being ordered.  The PS Warehousing and Logistics shall notify and inform the agency of exact details of delivery so that the goods are properly received."]
[]
[null,"2.4","A Reply Action Document (RAD) shall accompany the DR/APR to inform the agency of the status of outstanding/undelivered items to be served/delivered."]
[]
[null,"2.5","A Certificate of Non-Availability of Stocks (CNAS) shall accompany the DR/APR to inform the agency of the status of outstanding/undelivered items not to be served/delivered."]
[]
[null,"2.6","Residual funds as a result from this request maybe used by the agency for its next requisitions."]
[]
["3.0","RETURN POLICY:"]
[null,null,"Items sold/delivered to agencies shall be accepted for return or replacement within a period of fourteen (14) to thirty (30) days reckoned from the date of receipt of the item/s."]
[]
["4.0","AGENCY UNDERTAKING:"]
[null,null,"The requisitioning agency herewith undertakes that the requested supplies/materials/equipment are included in its Annual Procurement Plan (APP).  Correspondingly, the PS commits to deliver only the items programmed for purchase as appearing in its APP."]